如何解决npm安装错误“npm ERR!代码1“

浏览 4683关注 0回答 4得票数 16
原文

我正在尝试安装gulp,当我编写npm install时,我遇到了这个问题:

npm ERR! code 1
npm ERR! path D:\www\wegrow\node_modules\node-sass
npm ERR! command failed
npm ERR! command C:\Windows\system32\cmd.exe /d /s /c node scripts/build.js
npm ERR! Building: C:\Program Files (x86)\nodejs\node.exe D:\www\wegrow\node_modules\node-gyp\bin\node-gyp.js rebuild --verbose --libsass_ext= --libsass_cflags= --libsass_ldflags= --libsass_library=
npm ERR! gyp info it worked if it ends with ok
npm ERR! gyp verb cli [
npm ERR! gyp verb cli   'C:\\Program Files (x86)\\nodejs\\node.exe',
npm ERR! gyp verb cli   'D:\\www\\wegrow\\node_modules\\node-gyp\\bin\\node-gyp.js',
npm ERR! gyp verb cli   'rebuild',
npm ERR! gyp verb cli   '--verbose',
npm ERR! gyp verb cli   '--libsass_ext=',
npm ERR! gyp verb cli   '--libsass_cflags=',
npm ERR! gyp verb cli   '--libsass_ldflags=',
npm ERR! gyp verb cli   '--libsass_library='
npm ERR! gyp verb cli ]
npm ERR! gyp info using node-gyp@3.8.0
npm ERR! gyp info using node@16.1.0 | win32 | ia32
npm ERR! gyp verb command rebuild []
npm ERR! gyp verb command clean []
npm ERR! gyp verb clean removing "build" directory
npm ERR! gyp verb command configure []
npm ERR! gyp verb check python checking for Python executable "python2" in the PATH
npm ERR! gyp verb `which` failed Error: not found: python2
npm ERR! gyp verb `which` failed     at getNotFoundError (D:\www\wegrow\node_modules\which\which.js:13:12)
npm ERR! gyp verb `which` failed     at F (D:\www\wegrow\node_modules\which\which.js:68:19)
npm ERR! gyp verb `which` failed     at E (D:\www\wegrow\node_modules\which\which.js:80:29)
npm ERR! gyp verb `which` failed     at D:\www\wegrow\node_modules\which\which.js:89:16
npm ERR! gyp verb `which` failed     at D:\www\wegrow\node_modules\isexe\index.js:42:5
npm ERR! gyp verb `which` failed     at D:\www\wegrow\node_modules\isexe\windows.js:36:5
npm ERR! gyp verb `which` failed     at FSReqCallback.oncomplete (node:fs:194:21)
npm ERR! gyp verb `which` failed  python2 Error: not found: python2
npm ERR! gyp verb `which` failed     at getNotFoundError (D:\www\wegrow\node_modules\which\which.js:13:12)
npm ERR! gyp verb `which` failed     at F (D:\www\wegrow\node_modules\which\which.js:68:19)
npm ERR! gyp verb `which` failed     at E (D:\www\wegrow\node_modules\which\which.js:80:29)
npm ERR! gyp verb `which` failed     at D:\www\wegrow\node_modules\which\which.js:89:16
npm ERR! gyp verb `which` failed     at D:\www\wegrow\node_modules\isexe\index.js:42:5
npm ERR! gyp verb `which` failed     at D:\www\wegrow\node_modules\isexe\windows.js:36:5
npm ERR! gyp verb `which` failed     at FSReqCallback.oncomplete (node:fs:194:21) {
npm ERR! gyp verb `which` failed   code: 'ENOENT'
npm ERR! gyp verb `which` failed }
npm ERR! gyp verb check python checking for Python executable "python" in the PATH
npm ERR! gyp verb `which` succeeded python C:\Python39\python.EXE
npm ERR! gyp ERR! configure error
npm ERR! gyp ERR! stack Error: Command failed: C:\Python39\python.EXE -c import sys; print "%s.%s.%s" % sys.version_info[:3];
npm ERR! gyp ERR! stack   File "<string>", line 1
npm ERR! gyp ERR! stack     import sys; print "%s.%s.%s" % sys.version_info[:3];
npm ERR! gyp ERR! stack                       ^
npm ERR! gyp ERR! stack SyntaxError: invalid syntax
npm ERR! gyp ERR! stack
npm ERR! gyp ERR! stack     at ChildProcess.exithandler (node:child_process:326:12)
npm ERR! gyp ERR! stack     at ChildProcess.emit (node:events:365:28)
npm ERR! gyp ERR! stack     at maybeClose (node:internal/child_process:1067:16)
npm ERR! gyp ERR! stack     at Socket.<anonymous> (node:internal/child_process:453:11)
npm ERR! gyp ERR! stack     at Socket.emit (node:events:365:28)
npm ERR! gyp ERR! stack     at Pipe.<anonymous> (node:net:661:12)
npm ERR! gyp ERR! System Windows_NT 10.0.19042
npm ERR! gyp ERR! command "C:\\Program Files (x86)\\nodejs\\node.exe" "D:\\www\\wegrow\\node_modules\\node-gyp\\bin\\node-gyp.js" "rebuild" "--verbose" "--libsass_ext=" "--libsass_cflags=" "--libsass_ldflags=" "--libsass_library="
npm ERR! gyp ERR! cwd D:\www\wegrow\node_modules\node-sass
npm ERR! gyp ERR! node -v v16.1.0
npm ERR! gyp ERR! node-gyp -v v3.8.0
npm ERR! gyp ERR! not ok
npm ERR! Build failed with error code: 1

npm ERR! A complete log of this run can be found in:
npm ERR!     C:\Users\wbalu\AppData\Local\npm-cache\_logs\2021-05-05T10_38_29_779Z-debug.log

我已经格式化了我的电脑。以前一切都很正常。现在,当我尝试安装它时,它就会弹出。我试过重新安装node.js,但是没有用。我不知道我该怎么办。

原文
torek修改于2021-05-05 20:49

4 个回答

高票数最新
Frendzel
修改于2021-05-05 20:24
得票数 -1

试试npm install --python=python2.7。应该行得通。编辑:或者,--python=path to your python executable

AlejandroS
回答于2021-05-11 21:02已采纳
得票数 15

如果您的Node版本非常新,请尝试降级。稳定版本14.16.1起作用了。

OneCricketeer
修改于2021-08-24 05:18
得票数 4

尝试

npm cache clean --force

删除node_modules和包-lock.json

npm i
Dharman
修改于2021-10-03 15:07
得票数 2

我也遇到了这个问题。检查我的设置后,我发现没有任何问题,于是删除了缓存和包锁,但仍然没有成功。

这是一个较旧的网站,我尝试使用update/etc,但无济于事。

因此,我取出了package.json文件中的整个依赖项部分,并开始按照自己的方式一次安装一个。

它起作用了!

显然,几乎所有的版本都是一个主要的更新,这背后有太多的更新。

页面原文内容由Wojciech Ba?ucki、torek、Frendzel、AlejandroS、Jake、jimmont、???' ????、OneCricketeer、johnnydoe82、Andrew Fair、Dharman提供。腾讯云小微IT领域专用引擎提供翻译支持
原文链接:https://stackoverflow.com/questions/67399785复制

扫码关注腾讯云开发者

领取腾讯云代金券

http://www.vxiaotou.com